{"text_format":"1","workbook":"xlsx","n_sheets":3,"sheets":["Fiche de Course","Météo","Config"],"not_rendered":{"charts":0,"images":78,"macros":1,"external_links":0,"defined_names":41,"comments":0,"pivot_tables":0},"unopened":[],"bounds":{"document_bytes":16777216,"sheet_cells":100000,"rows_first":2000,"rows_last":500,"rows_between":2000,"halvings":0,"cell_chars":16384,"cell_head_chars":4096},"cells_cut":0,"cells_raw":0,"read":"whole","date_system":"1900"}

{"sheet":"Fiche de Course","index":0,"n_rows":52,"n_cols":13,"rows_kept":52,"cut":false,"hidden":false,"merged":[[47,9,47,12],[28,1,28,6],[11,9,11,12],[30,9,30,12],[39,9,39,12],[15,1,15,6],[22,1,26,6],[4,1,4,6],[4,9,4,12],[10,1,10,6],[1,6,1,12],[2,6,2,13],[1,1,2,5]]}
[]
[null,{"$error":"#VALUE!"},null,null,null,null,"Finale - Rover All Series - OceAsia '23"]
[null,null,null,null,null,null,{"$f":"IF(Config!$V$2=\"FR\",Config!A2,Config!B2)","v":"FICHE DE COURSE"}]
[]
[null,{"$f":"IF(Config!$V$2=\"FR\",Config!A3,Config!B3)","v":"PARAMÈTRES DU SALON"},null,null,null,null,null,null,null,{"$f":"IF(Config!$U$2=\"NO\",\"\",IF(Config!$V$2=\"FR\",Config!A45,Config!B45))","v":"PARAMÈTRES DE QUALIFICATIONS"}]
[null,null,null,{"$f":"IF(Config!$V$2=\"FR\",Config!A4,Config!B4)","v":"Mode Salon"},"Entraînement / Qualification / Course d'endurance"," ",{"$f":"VLOOKUP(E6,Config!D2:F6,3,FALSE)","v":"Entraînement / Qualification / Course d'endurance"},null,null,{"$f":"IF(Config!$U$2=\"NO\",\"\",IF(Config!$V$2=\"FR\",Config!A46,Config!B46))","v":"Limite de temps"},"10 mn"," ",{"$f":"IF(Config!$U$2=\"NO\",\"\",K6)","v":"10 mn"}]
[null,null,null,{"$f":"IF(Config!$V$2=\"FR\",Config!A5,Config!B5)","v":"Accès au salon"},"Amis uniquement"," ",{"$f":"VLOOKUP(E7,Config!D8:F9,3,FALSE)","v":"Amis uniquement"},null,null,{"$f":"IF(Config!$U$2=\"NO\",\"\",IF(Config!$V$2=\"FR\",Config!A47,Config!B47))","v":"Heure de reprise des qualifications"},"180 s"," ",{"$f":"IF(Config!$U$2=\"NO\",\"\",K7)","v":"180 s"}]
[null,null,null,{"$f":"IF(Config!$V$2=\"FR\",Config!A6,Config!B6)","v":"Type de Course"},"Course réelle"," ",{"$f":"VLOOKUP(E8,Config!D11:F14,3,FALSE)","v":"Course réelle"},null,null,{"$f":"IF(Config!$U$2=\"NO\",\"\",IF(Config!$V$2=\"FR\",Config!A48,Config!B48))","v":"Usure pneumatique (qualifications)"},"x0"," ",{"$f":"IF(Config!$U$2=\"NO\",\"\",IF(K8=\"x0\",IF(Config!$V$2=\"FR\",\"Non\",\"No\"),IF(K8=\"S/Race\",IF(Config!$V$2=\"FR\",\"Conditions de course\",\"Race Condition\"),K8)))","v":"Non"}]
[null,null,null,{"$f":"IF(Config!$V$2=\"FR\",Config!A7,Config!B7)","v":"Nombre max. de participants"},16," ",{"$f":"E9","v":16},null,null,{"$f":"IF(Config!$U$2=\"NO\",\"\",IF(Config!$V$2=\"FR\",Config!A49,Config!B49))","v":"Consommation de carburant (qualifications)"},"S/Race"," ",{"$f":"IF(Config!$U$2=\"NO\",\"\",IF(K9=\"x0\",IF(Config!$V$2=\"FR\",\"Non\",\"No\"),IF(K9=\"S/Race\",IF(Config!$V$2=\"FR\",\"Conditions de course\",\"Race Condition\"),K9)))","v":"Conditions de course"}]
[null,null,null,null,null,null,null,null,null,{"$f":"IF(Config!$U$2=\"NO\",\"\",IF(Config!$V$2=\"FR\",Config!A50,Config!B50))","v":"Carburant initial (qualifications)"},"S/Race"," ",{"$f":"IF(Config!$U$2=\"NO\",\"\",IF(K10=\"Défaut\",IF(Config!$V$2=\"FR\",\"Défaut\",\"Default\"),IF(K10=\"S/Race\",IF(Config!$V$2=\"FR\",\"Conditions de course\",\"Race Condition\"),K10)))","v":"Conditions de course"}]
[null,{"$f":"IF(Config!$V$2=\"FR\",Config!A8,Config!B8)","v":"PARAMÈTRES DU CIRCUIT"}]
[null,null,null,{"$f":"IF(Config!$V$2=\"FR\",Config!A9,Config!B9)","v":"Démarrage automatique"}," -- "," ",{"$f":"E12","v":" -- "},null,null,{"$f":"IF(Config!$V$2=\"FR\",Config!A51,Config!B51)","v":"PARAMÈTRES DES RÈGLES"}]
[null,null,null,{"$f":"IF(Config!$V$2=\"FR\",Config!A10,Config!B10)","v":"Circuit"},"24 Heures du Nürburgring"," ",{"$f":"E13","v":"24 Heures du Nürburgring"},null,null,{"$f":"IF(Config!$V$2=\"FR\",Config!A52,Config!B52)","v":"Filtrer par catégorie"},"Gr.3"," ",{"$f":"VLOOKUP(K13,Config!D59:F64,3,FALSE)","v":"Gr.3"}]
[null,null,null,{"$f":"IF(Config!$V$2=\"FR\",Config!A11,Config!B11)","v":"Limite de temps"},"2h"," ",{"$f":"IF(Config!C11=\"Nombre de tours\",E14&IF(Config!V2=\"FR\",\" Tours\",\" Laps\"),'Fiche de Course'!E14)","v":"2h"},null,null,{"$f":"IF(Config!$V$2=\"FR\",Config!A53,Config!B53)","v":"Limite de PP"},"No"," ",{"$f":"IF(K14=\"No\",IF(Config!$V$2=\"FR\",\"Aucune limite\",\"No Limit\"),K14)","v":"Aucune limite"}]
[null,null,null,null,null,null,null,null,null,{"$f":"IF(Config!$V$2=\"FR\",Config!A54,Config!B54)","v":"Puissance max."},271," ",{"$f":"IF(K15=\"No\",IF(Config!$V$2=\"FR\",\"Aucune limite\",\"No Limit\"),K15&\" ch\")","v":"271 ch"}]
{"$rows_left_out":38}
{"sheet":"Météo","index":1,"n_rows":25,"n_cols":13,"rows_kept":25,"cut":false,"hidden":false,"merged":[[7,1,9,12],[24,1,24,9]]}
[]
[]
[]
[]
[null,{"$f":"IF(B6=\"Random\",Config!$AD$1,IF(B6=\"S01\",Config!$AD$2,IF(B6=\"S02\",Config!$AD$3,IF(B6=\"S03\",Config!$AD$4,IF(B6=\"S04\",Config!$AD$5,IF(B6=\"S05\",Config!$AD$6,IF(B6=\"S06\",Config!$AD$7,IF(B6=\"S07\",Config!$AD$8,IF(B6=\"S08\",Config!$AD$9,IF(B6=\"S09\",Config!$AD$10,IF(B6=\"S10\",Config!$AD$11,IF(B6=\"S11\",Config!$AD$12,IF(B6=\"S12\",Config!$AD$13,IF(B6=\"S13\",Config!$AD$14,IF(B6=\"S14\",Config!$AD$15,IF(B6=\"S15\",Config!$AD$16,IF(B6=\"S16\",Config!$AD$17,IF(B6=\"S17\",Config!$AD$18,IF(B6=\"S18\",Config!$AD$19,IF(B6=\"C01\",Config!$AD$20,IF(B6=\"C02\",Config!$AD$21,IF(B6=\"C03\",Config!$AD$22,IF(B6=\"C04\",Config!$AD$23,IF(B6=\"C05\",Config!$AD$24,IF(B6=\"C06\",Config!$AD$25,IF(B6=\"R01\",Config!$AD$26,IF(B6=\"R02\",Config!$AD$27,IF(B6=\"R03\",Config!$AD$28,IF(B6=\"R04\",Config!$AD$29,IF(B6=\"R05\",Config!$AD$30,IF(B6=\"R06\",Config!$AD$31,IF(B6=\"R07\",Config!$AD$32,IF(B6=\"R08\",Config!$AD$33,\"\")))))))))))))))))))))))))))))))))","v":{"$error":"#VALUE!"}},{"$f":"IF(C6=\"Random\",Config!$AD$1,IF(C6=\"S01\",Config!$AD$2,IF(C6=\"S02\",Config!$AD$3,IF(C6=\"S03\",Config!$AD$4,IF(C6=\"S04\",Config!$AD$5,IF(C6=\"S05\",Config!$AD$6,IF(C6=\"S06\",Config!$AD$7,IF(C6=\"S07\",Config!$AD$8,IF(C6=\"S08\",Config!$AD$9,IF(C6=\"S09\",Config!$AD$10,IF(C6=\"S10\",Config!$AD$11,IF(C6=\"S11\",Config!$AD$12,IF(C6=\"S12\",Config!$AD$13,IF(C6=\"S13\",Config!$AD$14,IF(C6=\"S14\",Config!$AD$15,IF(C6=\"S15\",Config!$AD$16,IF(C6=\"S16\",Config!$AD$17,IF(C6=\"S17\",Config!$AD$18,IF(C6=\"S18\",Config!$AD$19,IF(C6=\"C01\",Config!$AD$20,IF(C6=\"C02\",Config!$AD$21,IF(C6=\"C03\",Config!$AD$22,IF(C6=\"C04\",Config!$AD$23,IF(C6=\"C05\",Config!$AD$24,IF(C6=\"C06\",Config!$AD$25,IF(C6=\"R01\",Config!$AD$26,IF(C6=\"R02\",Config!$AD$27,IF(C6=\"R03\",Config!$AD$28,IF(C6=\"R04\",Config!$AD$29,IF(C6=\"R05\",Config!$AD$30,IF(C6=\"R06\",Config!$AD$31,IF(C6=\"R07\",Config!$AD$32,IF(C6=\"R08\",Config!$AD$33,\"\")))))))))))))))))))))))))))))))))","v":{"$error":"#VALUE!"}},{"$f":"IF(D6=\"Random\",Config!$AD$1,IF(D6=\"S01\",Config!$AD$2,IF(D6=\"S02\",Config!$AD$3,IF(D6=\"S03\",Config!$AD$4,IF(D6=\"S04\",Config!$AD$5,IF(D6=\"S05\",Config!$AD$6,IF(D6=\"S06\",Config!$AD$7,IF(D6=\"S07\",Config!$AD$8,IF(D6=\"S08\",Config!$AD$9,IF(D6=\"S09\",Config!$AD$10,IF(D6=\"S10\",Config!$AD$11,IF(D6=\"S11\",Config!$AD$12,IF(D6=\"S12\",Config!$AD$13,IF(D6=\"S13\",Config!$AD$14,IF(D6=\"S14\",Config!$AD$15,IF(D6=\"S15\",Config!$AD$16,IF(D6=\"S16\",Config!$AD$17,IF(D6=\"S17\",Config!$AD$18,IF(D6=\"S18\",Config!$AD$19,IF(D6=\"C01\",Config!$AD$20,IF(D6=\"C02\",Config!$AD$21,IF(D6=\"C03\",Config!$AD$22,IF(D6=\"C04\",Config!$AD$23,IF(D6=\"C05\",Config!$AD$24,IF(D6=\"C06\",Config!$AD$25,IF(D6=\"R01\",Config!$AD$26,IF(D6=\"R02\",Config!$AD$27,IF(D6=\"R03\",Config!$AD$28,IF(D6=\"R04\",Config!$AD$29,IF(D6=\"R05\",Config!$AD$30,IF(D6=\"R06\",Config!$AD$31,IF(D6=\"R07\",Config!$AD$32,IF(D6=\"R08\",Config!$AD$33,\"\")))))))))))))))))))))))))))))))))","v":{"$error":"#VALUE!"}},{"$f":"IF(E6=\"Random\",Config!$AD$1,IF(E6=\"S01\",Config!$AD$2,IF(E6=\"S02\",Config!$AD$3,IF(E6=\"S03\",Config!$AD$4,IF(E6=\"S04\",Config!$AD$5,IF(E6=\"S05\",Config!$AD$6,IF(E6=\"S06\",Config!$AD$7,IF(E6=\"S07\",Config!$AD$8,IF(E6=\"S08\",Config!$AD$9,IF(E6=\"S09\",Config!$AD$10,IF(E6=\"S10\",Config!$AD$11,IF(E6=\"S11\",Config!$AD$12,IF(E6=\"S12\",Config!$AD$13,IF(E6=\"S13\",Config!$AD$14,IF(E6=\"S14\",Config!$AD$15,IF(E6=\"S15\",Config!$AD$16,IF(E6=\"S16\",Config!$AD$17,IF(E6=\"S17\",Config!$AD$18,IF(E6=\"S18\",Config!$AD$19,IF(E6=\"C01\",Config!$AD$20,IF(E6=\"C02\",Config!$AD$21,IF(E6=\"C03\",Config!$AD$22,IF(E6=\"C04\",Config!$AD$23,IF(E6=\"C05\",Config!$AD$24,IF(E6=\"C06\",Config!$AD$25,IF(E6=\"R01\",Config!$AD$26,IF(E6=\"R02\",Config!$AD$27,IF(E6=\"R03\",Config!$AD$28,IF(E6=\"R04\",Config!$AD$29,IF(E6=\"R05\",Config!$AD$30,IF(E6=\"R06\",Config!$AD$31,IF(E6=\"R07\",Config!$AD$32,IF(E6=\"R08\",Config!$AD$33,\"\")))))))))))))))))))))))))))))))))","v":{"$error":"#VALUE!"}},{"$f":"IF(F6=\"Random\",Config!$AD$1,IF(F6=\"S01\",Config!$AD$2,IF(F6=\"S02\",Config!$AD$3,IF(F6=\"S03\",Config!$AD$4,IF(F6=\"S04\",Config!$AD$5,IF(F6=\"S05\",Config!$AD$6,IF(F6=\"S06\",Config!$AD$7,IF(F6=\"S07\",Config!$AD$8,IF(F6=\"S08\",Config!$AD$9,IF(F6=\"S09\",Config!$AD$10,IF(F6=\"S10\",Config!$AD$11,IF(F6=\"S11\",Config!$AD$12,IF(F6=\"S12\",Config!$AD$13,IF(F6=\"S13\",Config!$AD$14,IF(F6=\"S14\",Config!$AD$15,IF(F6=\"S15\",Config!$AD$16,IF(F6=\"S16\",Config!$AD$17,IF(F6=\"S17\",Config!$AD$18,IF(F6=\"S18\",Config!$AD$19,IF(F6=\"C01\",Config!$AD$20,IF(F6=\"C02\",Config!$AD$21,IF(F6=\"C03\",Config!$AD$22,IF(F6=\"C04\",Config!$AD$23,IF(F6=\"C05\",Config!$AD$24,IF(F6=\"C06\",Config!$AD$25,IF(F6=\"R01\",Config!$AD$26,IF(F6=\"R02\",Config!$AD$27,IF(F6=\"R03\",Config!$AD$28,IF(F6=\"R04\",Config!$AD$29,IF(F6=\"R05\",Config!$AD$30,IF(F6=\"R06\",Config!$AD$31,IF(F6=\"R07\",Config!$AD$32,IF(F6=\"R08\",Config!$AD$33,\"\")))))))))))))))))))))))))))))))))","v":{"$error":"#VALUE!"}},{"$f":"IF(G6=\"Random\",Config!$AD$1,IF(G6=\"S01\",Config!$AD$2,IF(G6=\"S02\",Config!$AD$3,IF(G6=\"S03\",Config!$AD$4,IF(G6=\"S04\",Config!$AD$5,IF(G6=\"S05\",Config!$AD$6,IF(G6=\"S06\",Config!$AD$7,IF(G6=\"S07\",Config!$AD$8,IF(G6=\"S08\",Config!$AD$9,IF(G6=\"S09\",Config!$AD$10,IF(G6=\"S10\",Config!$AD$11,IF(G6=\"S11\",Config!$AD$12,IF(G6=\"S12\",Config!$AD$13,IF(G6=\"S13\",Config!$AD$14,IF(G6=\"S14\",Config!$AD$15,IF(G6=\"S15\",Config!$AD$16,IF(G6=\"S16\",Config!$AD$17,IF(G6=\"S17\",Config!$AD$18,IF(G6=\"S18\",Config!$AD$19,IF(G6=\"C01\",Config!$AD$20,IF(G6=\"C02\",Config!$AD$21,IF(G6=\"C03\",Config!$AD$22,IF(G6=\"C04\",Config!$AD$23,IF(G6=\"C05\",Config!$AD$24,IF(G6=\"C06\",Config!$AD$25,IF(G6=\"R01\",Config!$AD$26,IF(G6=\"R02\",Config!$AD$27,IF(G6=\"R03\",Config!$AD$28,IF(G6=\"R04\",Config!$AD$29,IF(G6=\"R05\",Config!$AD$30,IF(G6=\"R06\",Config!$AD$31,IF(G6=\"R07\",Config!$AD$32,IF(G6=\"R08\",Config!$AD$33,\"\")))))))))))))))))))))))))))))))))","v":{"$error":"#VALUE!"}},{"$f":"IF(H6=\"Random\",Config!$AD$1,IF(H6=\"S01\",Config!$AD$2,IF(H6=\"S02\",Config!$AD$3,IF(H6=\"S03\",Config!$AD$4,IF(H6=\"S04\",Config!$AD$5,IF(H6=\"S05\",Config!$AD$6,IF(H6=\"S06\",Config!$AD$7,IF(H6=\"S07\",Config!$AD$8,IF(H6=\"S08\",Config!$AD$9,IF(H6=\"S09\",Config!$AD$10,IF(H6=\"S10\",Config!$AD$11,IF(H6=\"S11\",Config!$AD$12,IF(H6=\"S12\",Config!$AD$13,IF(H6=\"S13\",Config!$AD$14,IF(H6=\"S14\",Config!$AD$15,IF(H6=\"S15\",Config!$AD$16,IF(H6=\"S16\",Config!$AD$17,IF(H6=\"S17\",Config!$AD$18,IF(H6=\"S18\",Config!$AD$19,IF(H6=\"C01\",Config!$AD$20,IF(H6=\"C02\",Config!$AD$21,IF(H6=\"C03\",Config!$AD$22,IF(H6=\"C04\",Config!$AD$23,IF(H6=\"C05\",Config!$AD$24,IF(H6=\"C06\",Config!$AD$25,IF(H6=\"R01\",Config!$AD$26,IF(H6=\"R02\",Config!$AD$27,IF(H6=\"R03\",Config!$AD$28,IF(H6=\"R04\",Config!$AD$29,IF(H6=\"R05\",Config!$AD$30,IF(H6=\"R06\",Config!$AD$31,IF(H6=\"R07\",Config!$AD$32,IF(H6=\"R08\",Config!$AD$33,\"\")))))))))))))))))))))))))))))))))","v":{"$error":"#VALUE!"}},{"$f":"IF(I6=\"Random\",Config!$AD$1,IF(I6=\"S01\",Config!$AD$2,IF(I6=\"S02\",Config!$AD$3,IF(I6=\"S03\",Config!$AD$4,IF(I6=\"S04\",Config!$AD$5,IF(I6=\"S05\",Config!$AD$6,IF(I6=\"S06\",Config!$AD$7,IF(I6=\"S07\",Config!$AD$8,IF(I6=\"S08\",Config!$AD$9,IF(I6=\"S09\",Config!$AD$10,IF(I6=\"S10\",Config!$AD$11,IF(I6=\"S11\",Config!$AD$12,IF(I6=\"S12\",Config!$AD$13,IF(I6=\"S13\",Config!$AD$14,IF(I6=\"S14\",Config!$AD$15,IF(I6=\"S15\",Config!$AD$16,IF(I6=\"S16\",Config!$AD$17,IF(I6=\"S17\",Config!$AD$18,IF(I6=\"S18\",Config!$AD$19,IF(I6=\"C01\",Config!$AD$20,IF(I6=\"C02\",Config!$AD$21,IF(I6=\"C03\",Config!$AD$22,IF(I6=\"C04\",Config!$AD$23,IF(I6=\"C05\",Config!$AD$24,IF(I6=\"C06\",Config!$AD$25,IF(I6=\"R01\",Config!$AD$26,IF(I6=\"R02\",Config!$AD$27,IF(I6=\"R03\",Config!$AD$28,IF(I6=\"R04\",Config!$AD$29,IF(I6=\"R05\",Config!$AD$30,IF(I6=\"R06\",Config!$AD$31,IF(I6=\"R07\",Config!$AD$32,IF(I6=\"R08\",Config!$AD$33,\"\")))))))))))))))))))))))))))))))))","v":{"$error":"#VALUE!"}},{"$f":"IF(J6=\"Random\",Config!$AD$1,IF(J6=\"S01\",Config!$AD$2,IF(J6=\"S02\",Config!$AD$3,IF(J6=\"S03\",Config!$AD$4,IF(J6=\"S04\",Config!$AD$5,IF(J6=\"S05\",Config!$AD$6,IF(J6=\"S06\",Config!$AD$7,IF(J6=\"S07\",Config!$AD$8,IF(J6=\"S08\",Config!$AD$9,IF(J6=\"S09\",Config!$AD$10,IF(J6=\"S10\",Config!$AD$11,IF(J6=\"S11\",Config!$AD$12,IF(J6=\"S12\",Config!$AD$13,IF(J6=\"S13\",Config!$AD$14,IF(J6=\"S14\",Config!$AD$15,IF(J6=\"S15\",Config!$AD$16,IF(J6=\"S16\",Config!$AD$17,IF(J6=\"S17\",Config!$AD$18,IF(J6=\"S18\",Config!$AD$19,IF(J6=\"C01\",Config!$AD$20,IF(J6=\"C02\",Config!$AD$21,IF(J6=\"C03\",Config!$AD$22,IF(J6=\"C04\",Config!$AD$23,IF(J6=\"C05\",Config!$AD$24,IF(J6=\"C06\",Config!$AD$25,IF(J6=\"R01\",Config!$AD$26,IF(J6=\"R02\",Config!$AD$27,IF(J6=\"R03\",Config!$AD$28,IF(J6=\"R04\",Config!$AD$29,IF(J6=\"R05\",Config!$AD$30,IF(J6=\"R06\",Config!$AD$31,IF(J6=\"R07\",Config!$AD$32,IF(J6=\"R08\",Config!$AD$33,\"\")))))))))))))))))))))))))))))))))","v":""},{"$f":"IF(K6=\"Random\",Config!$AD$1,IF(K6=\"S01\",Config!$AD$2,IF(K6=\"S02\",Config!$AD$3,IF(K6=\"S03\",Config!$AD$4,IF(K6=\"S04\",Config!$AD$5,IF(K6=\"S05\",Config!$AD$6,IF(K6=\"S06\",Config!$AD$7,IF(K6=\"S07\",Config!$AD$8,IF(K6=\"S08\",Config!$AD$9,IF(K6=\"S09\",Config!$AD$10,IF(K6=\"S10\",Config!$AD$11,IF(K6=\"S11\",Config!$AD$12,IF(K6=\"S12\",Config!$AD$13,IF(K6=\"S13\",Config!$AD$14,IF(K6=\"S14\",Config!$AD$15,IF(K6=\"S15\",Config!$AD$16,IF(K6=\"S16\",Config!$AD$17,IF(K6=\"S17\",Config!$AD$18,IF(K6=\"S18\",Config!$AD$19,IF(K6=\"C01\",Config!$AD$20,IF(K6=\"C02\",Config!$AD$21,IF(K6=\"C03\",Config!$AD$22,IF(K6=\"C04\",Config!$AD$23,IF(K6=\"C05\",Config!$AD$24,IF(K6=\"C06\",Config!$AD$25,IF(K6=\"R01\",Config!$AD$26,IF(K6=\"R02\",Config!$AD$27,IF(K6=\"R03\",Config!$AD$28,IF(K6=\"R04\",Config!$AD$29,IF(K6=\"R05\",Config!$AD$30,IF(K6=\"R06\",Config!$AD$31,IF(K6=\"R07\",Config!$AD$32,IF(K6=\"R08\",Config!$AD$33,\"\")))))))))))))))))))))))))))))))))","v":""},{"$f":"IF(L6=\"Random\",Config!$AD$1,IF(L6=\"S01\",Config!$AD$2,IF(L6=\"S02\",Config!$AD$3,IF(L6=\"S03\",Config!$AD$4,IF(L6=\"S04\",Config!$AD$5,IF(L6=\"S05\",Config!$AD$6,IF(L6=\"S06\",Config!$AD$7,IF(L6=\"S07\",Config!$AD$8,IF(L6=\"S08\",Config!$AD$9,IF(L6=\"S09\",Config!$AD$10,IF(L6=\"S10\",Config!$AD$11,IF(L6=\"S11\",Config!$AD$12,IF(L6=\"S12\",Config!$AD$13,IF(L6=\"S13\",Config!$AD$14,IF(L6=\"S14\",Config!$AD$15,IF(L6=\"S15\",Config!$AD$16,IF(L6=\"S16\",Config!$AD$17,IF(L6=\"S17\",Config!$AD$18,IF(L6=\"S18\",Config!$AD$19,IF(L6=\"C01\",Config!$AD$20,IF(L6=\"C02\",Config!$AD$21,IF(L6=\"C03\",Config!$AD$22,IF(L6=\"C04\",Config!$AD$23,IF(L6=\"C05\",Config!$AD$24,IF(L6=\"C06\",Config!$AD$25,IF(L6=\"R01\",Config!$AD$26,IF(L6=\"R02\",Config!$AD$27,IF(L6=\"R03\",Config!$AD$28,IF(L6=\"R04\",Config!$AD$29,IF(L6=\"R05\",Config!$AD$30,IF(L6=\"R06\",Config!$AD$31,IF(L6=\"R07\",Config!$AD$32,IF(L6=\"R08\",Config!$AD$33,\"\")))))))))))))))))))))))))))))))))","v":""},{"$f":"IF(M6=\"Random\",Config!$AD$1,IF(M6=\"S01\",Config!$AD$2,IF(M6=\"S02\",Config!$AD$3,IF(M6=\"S03\",Config!$AD$4,IF(M6=\"S04\",Config!$AD$5,IF(M6=\"S05\",Config!$AD$6,IF(M6=\"S06\",Config!$AD$7,IF(M6=\"S07\",Config!$AD$8,IF(M6=\"S08\",Config!$AD$9,IF(M6=\"S09\",Config!$AD$10,IF(M6=\"S10\",Config!$AD$11,IF(M6=\"S11\",Config!$AD$12,IF(M6=\"S12\",Config!$AD$13,IF(M6=\"S13\",Config!$AD$14,IF(M6=\"S14\",Config!$AD$15,IF(M6=\"S15\",Config!$AD$16,IF(M6=\"S16\",Config!$AD$17,IF(M6=\"S17\",Config!$AD$18,IF(M6=\"S18\",Config!$AD$19,IF(M6=\"C01\",Config!$AD$20,IF(M6=\"C02\",Config!$AD$21,IF(M6=\"C03\",Config!$AD$22,IF(M6=\"C04\",Config!$AD$23,IF(M6=\"C05\",Config!$AD$24,IF(M6=\"C06\",Config!$AD$25,IF(M6=\"R01\",Config!$AD$26,IF(M6=\"R02\",Config!$AD$27,IF(M6=\"R03\",Config!$AD$28,IF(M6=\"R04\",Config!$AD$29,IF(M6=\"R05\",Config!$AD$30,IF(M6=\"R06\",Config!$AD$31,IF(M6=\"R07\",Config!$AD$32,IF(M6=\"R08\",Config!$AD$33,\"\")))))))))))))))))))))))))))))))))","v":""}]
[{"$f":"COUNTA(B6:M6)","v":8},"S01","S02","R01","R02","R08","R08","R08","R07"]
[]
[null,"Cette page sert à générer une image des différentes tuiles de météo à insérer dans l'onglet \"Fiche de Course\" avec le bouton \"Valider\""]
[]
[]
[]
[null,"S01","S02","S03","S04","S05","S06","S07","S08","S09"]
[]
[]
[null,"S10","S11","S12","S13","S14","S15","S16","S17","S18"]
{"$rows_left_out":11}
{"sheet":"Config","index":2,"n_rows":1503,"n_cols":31,"rows_kept":1503,"cut":false,"hidden":true,"merged":[[0,22,1,22],[2,22,3,22]]}
["Français","English","Selected","Français","English","Selected","Liste des Circuits","Kg","PP/CV","Lap","Init Fuel","Nitro","Use","Temps","Météo","Time","Fuel","End","Start","Pneus","Qualif","Trad.","Pneus Dispo",true,true,true,true,true,"Tunning",{"$error":"#VALUE!"},"Random"]
["FICHE DE COURSE","RACE CARD",null,"Course libre","Free Run",{"$f":"IF(Config!$V$2=\"FR\",Config!D2,Config!E2)","v":"Course libre"},"24 Heures du Nürburgring","No","No",1,"S/Race","Def","S/Race","1 mn","Random","x0","1 L/s","30 s"," -- ","No",{"$f":"IF(ISNUMBER(SEARCH(\"qualif\",'Fiche de Course'!G6)),\"YES\",\"NO\")","v":"YES"},"FR",null,{"$f":"IF(Config!X1=TRUE,1,0)","v":1},{"$f":"IF(Config!Y1=TRUE,1,0)","v":1},{"$f":"IF(Config!Z1=TRUE,1,0)","v":1},{"$f":"IF(Config!AA1=TRUE,1,0)","v":1},{"$f":"IF(Config!AB1=TRUE,1,0)","v":1},{"$f":"SUM(AC3:AC9)","v":13},{"$error":"#VALUE!"},"S01"]
["PARAMÈTRES DU SALON","ROOM SETTINGS",null,"Entraînement / Course","Practice / Race",{"$f":"IF(Config!$V$2=\"FR\",Config!D3,Config!E3)","v":"Entraînement / Course"},"Alsace - Site d'essais",500,100,2,"Défaut","x0,1","x0","2 mn","S01","x1","2 L/s","40 s","1 mn","Confort",null,null,"Pneus Requis",{"$f":"IF(Config!X4=TRUE,1,0)","v":0},{"$f":"IF(Config!Y4=TRUE,1,0)","v":1},{"$f":"IF(Config!Z4=TRUE,1,0)","v":1},null,null,{"$f":"IF('Fiche de Course'!C34=TRUE,1,0)+IF('Fiche de Course'!F34=TRUE,1,0)","v":2},{"$error":"#VALUE!"},"S02"]
["Mode Salon","Room Mode",null,"Entraînement / Qualifications / Course","Practice / Qualifications / Race",{"$f":"IF(Config!$V$2=\"FR\",Config!D4,Config!E4)","v":"Entraînement / Qualifications / Course"},"Alsace - Site d'essais II",501,101,3,0.01,"x0,2","x1","3 mn","S02","x2","3 L/s","50 s","2 mn","Sport",null,null,null,false,true,true,null,null,{"$f":"IF('Fiche de Course'!C35=TRUE,1,0)+IF('Fiche de Course'!F35=TRUE,1,0)","v":2},{"$error":"#VALUE!"},"S03"]
["Accès au salon","Room Privacy",null,"Entraînement / Course d'endurance","Practice / Endurance Race",{"$f":"IF(Config!$V$2=\"FR\",Config!D5,Config!E5)","v":"Entraînement / Course d'endurance"},"Alsace - Village ",502,102,4,0.02,"x0,3","x2","5 mn","S03","x3","4 L/s","60 s","3 mn","Course",null,null,null,null,null,null,null,null,{"$f":"IF('Fiche de Course'!C36=TRUE,1,0)+IF('Fiche de Course'!F36=TRUE,1,0)","v":2},{"$error":"#VALUE!"},"S04"]
["Type de Course","Race Type",null,"Entraînement / Qualification / Course d'endurance","Practice / Qualification / Endurance Race",{"$f":"IF(Config!$V$2=\"FR\",Config!D6,Config!E6)","v":"Entraînement / Qualification / Course d'endurance"},"Alsace - Village II",503,103,5,0.03,"x0,4","x3","10 mn","S04","x4","5 L/s","70 s","4 mn",null,null,null,null,null,null,null,null,null,{"$f":"IF('Fiche de Course'!C37=TRUE,1,0)+IF('Fiche de Course'!F37=TRUE,1,0)","v":2},{"$error":"#VALUE!"},"S05"]
["Nombre max. de participants","Max. Number of Participants",null,null,null,null,"Autodrome Lago Maggiore - Centre",504,104,6,0.04,"x0,5","x4","15 mn","S05","x5","6 L/s","80 s","5 mn",null,null,null,null,null,null,null,null,null,{"$f":"IF('Fiche de Course'!C38=TRUE,1,0)+IF('Fiche de Course'!F38=TRUE,1,0)","v":2},{"$error":"#VALUE!"},"S06"]
["PARAMÈTRES DU CIRCUIT","TRACK SETTINGS",null,"Public","Public",{"$f":"IF(Config!$V$2=\"FR\",Config!D8,Config!E8)","v":"Public"},"Autodrome Lago Maggiore - Centre II",505,105,7,0.05,"x0,6","x5","20 mn","S06","x6","7 L/s","90 s","6 mn",null,null,null,null,null,null,null,null,null,{"$f":"IF('Fiche de Course'!C39=TRUE,1,0)+IF('Fiche de Course'!F39=TRUE,1,0)","v":2},{"$error":"#VALUE!"},"S07"]
["Démarrage automatique","Auto-Start",null,"Amis uniquement","Friends Only",{"$f":"IF(Config!$V$2=\"FR\",Config!D9,Config!E9)","v":"Amis uniquement"},"Autodrome Lago Maggiore - Est",506,106,8,0.06,"x0,7","x6","25 mn","S07","x7","8 L/s","100 s","7 mn",null,null,null,null,null,null,null,null,null,{"$f":"IF('Fiche de Course'!C40=TRUE,1,0)+IF('Fiche de Course'!F40=TRUE,1,0)","v":1},{"$error":"#VALUE!"},"S08"]
["Circuit","Track",null,null,null,null,"Autodrome Lago Maggiore - Est II",507,107,9,7.0000000000000007E-2,"x0,8","x7","30 mn","S08","x8","9 L/s","110 s","8 mn",null,null,null,null,null,null,null,null,null,null,{"$error":"#VALUE!"},"S09"]
[{"$f":"IF(ISNUMBER(SEARCH(\"endurance\",'Fiche de Course'!G6)),\"Limite de temps\",\"Nombre de tours\")","v":"Limite de temps"},{"$f":"IF(ISNUMBER(SEARCH(\"endurance\",'Fiche de Course'!G6)),\"Time Limit\",\"No. Of Laps\")","v":"Time Limit"},{"$f":"IF(Config!$V$2=\"FR\",Config!A11,Config!A11)","v":"Limite de temps"},"Course amicale","Friendly Race",{"$f":"IF(Config!$V$2=\"FR\",Config!D11,Config!E11)","v":"Course amicale"},"Autodrome Lago Maggiore - Extrémité est",508,108,10,0.08,"x0,9","x8","40 mn","S09","x9","10 L/s","120 s","9 mn",null,null,null,null,null,null,null,null,null,null,{"$error":"#VALUE!"},"S10"]
["PARAMÈTRES MÉTÉO / HORAIRES","TIME AND WEATHER SETTINGS",null,"Course Libre","Free Race",{"$f":"IF(Config!$V$2=\"FR\",Config!D12,Config!E12)","v":"Course Libre"},"Autodrome Lago Maggiore - Extrémité est II",509,109,11,0.09,"x1,1","x9","50 mn","S10","x10","11 L/s","130 s","10 mn",null,null,null,null,null,null,null,null,null,null,{"$error":"#VALUE!"},"S11"]
["Méthode de sélection météo","Weather Selection Method",null,"Drift","Drift",{"$f":"IF(Config!$V$2=\"FR\",Config!D13,Config!E13)","v":"Drift"},"Autodrome Lago Maggiore - Extrémité ouest",510,110,12,0.1,"x1,2","x10","60 mn","S11","x11","12 L/s","140 s",null,null,null,null,null,null,null,null,null,null,null,{"$error":"#VALUE!"},"S12"]
[{"$f":"IF(ISNUMBER(SEARCH(\"pr\",'Fiche de Course'!G17)),\"Météo prédéfinie\",\"Météo personnalisés\")","v":"Météo personnalisés"},{"$f":"IF(ISNUMBER(SEARCH(\"pr\",'Fiche de Course'!G17)),\"Preset Weather\",\"Custom Weather\")","v":"Custom Weather"},{"$f":"IF(Config!$V$2=\"FR\",Config!A14,Config!A14)","v":"Météo personnalisés"},"Course réelle","Real Race",{"$f":"IF(Config!$V$2=\"FR\",Config!D14,Config!E14)","v":"Course réelle"},"Autodrome Lago Maggiore - Extrémité ouest II",511,111,13,0.11,"x1,3","x11","90 mn","S12","x12","13 L/s","150 s",null,null,null,null,null,null,null,null,null,null,null,{"$error":"#VALUE!"},"S13"]
["Mode conditions égales","Equal Conditions Mode",{"$f":"IF(Config!$V$2=\"FR\",Config!A15,Config!A15)","v":"Mode conditions égales"},null,null,null,"Autodrome Lago Maggiore - Ouest",512,112,14,0.12,"x1,4","x12","2h","S13","x13","14 L/s","160 s",null,null,null,null,null,null,null,null,null,null,null,{"$error":"#VALUE!"},"S14"]
{"$rows_left_out":1488}